Running nixpkgs-update (https://nix-community.org/update-bot/) with UPDATE_INFO: apko 1.2.4 -> 1.2.7 https://github.com/chainguard-dev/apko/releases attrpath: apko Checking auto update branch... No auto update branch exists [version] [version] generic version rewriter does not support multiple hashes [rustCrateVersion] [rustCrateVersion] No cargoHash found [golangModuleVersion] [golangModuleVersion] Found old vendorHash = "sha256-xAXI1qGNOhPiDWc6KQX7ThDqs67XhP+O+ideQiMG6B8=" [golangModuleVersion] Replaced vendorHash with sha256-xAXI1qGNOhPiDWc6KQX7ThDqs67XhP+O+ideQiMG6B8= Received ExitFailure 1 when running Raw command: nix-build --option sandbox true --arg config "{ allowUnfree = true; allowAliases = false; }" --arg overlays "[ ]" -A apko nix build failed. ok chainguard.dev/apko/pkg/apk/auth 0.007s ok chainguard.dev/apko/pkg/apk/expandapk 0.131s --- FAIL: TestSpecialModeBits (0.00s) --- FAIL: TestSpecialModeBits/setuid/Chmod_preserves (0.00s) rwosfs_test.go:780: Error Trace: /build/source/pkg/apk/fs/rwosfs_test.go:780 Error: Not equal: expected: 0x8001ed actual : 0x1ed Test: TestSpecialModeBits/setuid/Chmod_preserves Messages: Chmod after write should leave full mode (incl. specials) on disk --- FAIL: TestSpecialModeBits/setgid/Chmod_preserves (0.00s) rwosfs_test.go:780: Error Trace: /build/source/pkg/apk/fs/rwosfs_test.go:780 Error: Not equal: expected: 0x4001ed actual : 0x1ed Test: TestSpecialModeBits/setgid/Chmod_preserves Messages: Chmod after write should leave full mode (incl. specials) on disk --- FAIL: TestSpecialModeBits/setuid_setgid_sticky/Chmod_preserves (0.00s) rwosfs_test.go:780: Error Trace: /build/source/pkg/apk/fs/rwosfs_test.go:780 Error: Not equal: expected: 0xd001ed actual : 0x1ed Test: TestSpecialModeBits/setuid_setgid_sticky/Chmod_preserves Messages: Chmod after write should leave full mode (incl. specials) on disk FAIL FAIL chainguard.dev/apko/pkg/apk/fs 0.209s FAIL