Running nixpkgs-update (https://nix-community.org/update-bot/) with UPDATE_INFO: blightmud 5.3.1 -> 5.3.3 https://github.com/blightmud/blightmud/releases attrpath: blightmud Checking auto update branch... No auto update branch exists [version] [version] generic version rewriter does not support multiple hashes [rustCrateVersion] [rustCrateVersion] Replacing cargoHash with sha256-cN94A3HC+pSmedjuhk9GJPryf170MCNzEBpyVrkNlXg= Received ExitFailure 1 when running Raw command: nix-build --option sandbox true --arg config "{ allowUnfree = true; allowAliases = false; }" --arg overlays "[ ]" -A blightmud nix build failed.  Running tests/connection_tests.rs (target/x86_64-unknown-linux-gnu/release/deps/connection_tests-fc8ab4111bacf08c) running 0 tests test result: ok. 0 passed; 0 failed; 0 ignored; 0 measured; 4 filtered out; finished in 0.00s  Running tests/lua_tests.rs (target/x86_64-unknown-linux-gnu/release/deps/lua_tests-0f82995454c608ad) running 1 test test test_exec ... FAILED failures: ---- test_exec stdout ---- thread '' (9255) panicked at src/lib.rs:175:9: [!!] Logging failed to start: Os { code: 13, kind: PermissionDenied, message: "Permission denied" } note: run with `RUST_BACKTRACE=1` environment variable to display a backtrace thread 'test_exec' (9254) panicked at tests/common/mod.rs:18:23: called `Result::unwrap()` on an `Err` value: Any { .. } failures: test_exec test result: FAILED. 0 passed; 1 failed; 0 ignored; 0 measured; 4 filtered out; finished in 0.00s error: test failed, to rerun pass `--test lua_tests`