Running nixpkgs-update (https://nix-community.org/update-bot/) with UPDATE_INFO: blightmud 5.3.1 -> 5.6.0 https://github.com/blightmud/blightmud/releases attrpath: blightmud Checking auto update branch... No auto update branch exists [version] [version] generic version rewriter does not support multiple hashes [rustCrateVersion] [rustCrateVersion] Replacing cargoHash with sha256-YqgrU2g34rUmtRqLAj+pMq1xlSdSd/oOrp/IedA+tuE= Received ExitFailure 1 when running Raw command: nix-build --option sandbox true --arg config "{ allowUnfree = true; allowAliases = false; }" --arg overlays "[ ]" -A blightmud nix build failed. test test_line_tags ... FAILED test test_exec ... FAILED failures: ---- test_line_tags stdout ---- thread '' (9855) panicked at src/lib.rs:182:9: [!!] Logging failed to start: Os { code: 13, kind: PermissionDenied, message: "Permission denied" } note: run with `RUST_BACKTRACE=1` environment variable to display a backtrace thread 'test_line_tags' (9853) panicked at tests/common/mod.rs:18:23: called `Result::unwrap()` on an `Err` value: Any { .. } ---- test_exec stdout ---- thread '' (9854) panicked at src/lib.rs:182:9: [!!] Logging failed to start: Os { code: 13, kind: PermissionDenied, message: "Permission denied" } thread 'test_exec' (9852) panicked at tests/common/mod.rs:18:23: called `Result::unwrap()` on an `Err` value: Any { .. } failures: test_exec test_line_tags test result: FAILED. 0 passed; 2 failed; 0 ignored; 0 measured; 4 filtered out; finished in 0.01s error: test failed, to rerun pass `--test lua_tests`