Running nixpkgs-update (https://nix-community.org/update-bot/) with UPDATE_INFO: btfdump 0.0.4 -> 0.0.5 https://github.com/anakryiko/btfdump/releases attrpath: btfdump Checking auto update branch... No auto update branch exists [version] [version] generic version rewriter does not support multiple hashes [rustCrateVersion] [rustCrateVersion] Replacing cargoHash with sha256-hdLZ1CtOxqs9X1jo2FQlwj2kHl9pMtThnx6C75aAAZs= Received ExitFailure 1 when running Raw command: nix-build --option sandbox true --arg config "{ allowUnfree = true; allowAliases = false; }" --arg overlays "[ ]" -A btfdump nix build failed. test result: ok. 0 passed; 0 failed; 0 ignored; 0 measured; 0 filtered out; finished in 0.00s  Running unittests src/main.rs (target/x86_64-unknown-linux-gnu/release/deps/btf-8ab579487f57cc3b) running 0 tests test result: ok. 0 passed; 0 failed; 0 ignored; 0 measured; 0 filtered out; finished in 0.00s  Running tests/tests.rs (target/x86_64-unknown-linux-gnu/release/deps/tests-46e6148a6c0adec8) running 1 test test dump ... FAILED failures: ---- dump stdout ---- compiling tests/samples/embed_array2.c thread 'dump' (1265) panicked at tests/tests.rs:68:18: called `Result::unwrap()` on an `Err` value: Os { code: 2, kind: NotFound, message: "No such file or directory" } note: run with `RUST_BACKTRACE=1` environment variable to display a backtrace failures: dump test result: FAILED. 0 passed; 1 failed; 0 ignored; 0 measured; 0 filtered out; finished in 0.01s error: test failed, to rerun pass `--test tests`