Running nixpkgs-update (https://nix-community.org/update-bot/) with UPDATE_INFO: cargo-generate 0.23.9 -> 0.24.0 https://github.com/cargo-generate/cargo-generate/releases attrpath: cargo-generate Checking auto update branch... No auto update branch exists [version] [version] generic version rewriter does not support multiple hashes [rustCrateVersion] [rustCrateVersion] Replacing cargoHash with sha256-QhczEP3yGTX6Vz0PEtFKIUEPwE3ATl0nzz7DKHDD3Us= Received ExitFailure 1 when running Raw command: nix-build --option sandbox true --arg config "{ allowUnfree = true; allowAliases = false; }" --arg overlays "[ ]" -A cargo-generate nix build failed. ---- gix::tests::test_cloning_a_repo_at_revision stdout ---- thread 'gix::tests::test_cloning_a_repo_at_revision' (6135) panicked at src/gix/mod.rs:452:14: called `Result::unwrap()` on an `Err` value: Please check if the Git user / repository exists. Caused by: 0: Could not initialize the http client 1: builder error 2: unexpected error: No CA certificates were loaded from the system ---- gix::tests::test_cloning_a_repo_with_a_specific_branch stdout ---- thread 'gix::tests::test_cloning_a_repo_with_a_specific_branch' (6136) panicked at src/gix/mod.rs:469:14: called `Result::unwrap()` on an `Err` value: Please check if the Git user / repository exists. Caused by: 0: Could not initialize the http client 1: builder error 2: unexpected error: No CA certificates were loaded from the system failures: gix::tests::test_cloning_a_repo gix::tests::test_cloning_a_repo_at_revision gix::tests::test_cloning_a_repo_with_a_specific_branch test result: FAILED. 197 passed; 3 failed; 0 ignored; 0 measured; 0 filtered out; finished in 0.16s error: test failed, to rerun pass `--lib`