Running nixpkgs-update (https://nix-community.org/update-bot/) with UPDATE_INFO: convco 0.6.3 -> 0.6.4 https://github.com/convco/convco/releases attrpath: convco Checking auto update branch... No auto update branch exists [version] [version] generic version rewriter does not support multiple hashes [rustCrateVersion] [rustCrateVersion] Replacing cargoHash with sha256-QgLkTTSZ5Kkk+ysnD++Wa47rLMd6eL61WlkfXRgo4Jo= Received ExitFailure 1 when running Raw command: nix-build --option sandbox true --arg config "{ allowUnfree = true; allowAliases = false; }" --arg overlays "[ ]" -A convco nix build failed. test conventional::commits::tests::test_with_multi_body_and_footer ... ok test conventional::commits::tests::test_with_breaking_footer_alias ... ok failures: ---- git::tests::test_filter_message_pattern_no_match stdout ---- thread 'git::tests::test_filter_message_pattern_no_match' (4810) panicked at src/git.rs:294:41: called `Result::unwrap()` on an `Err` value: Error { code: -3, klass: 6, message: "could not find repository at '.'" } note: run with `RUST_BACKTRACE=1` environment variable to display a backtrace ---- git::tests::test_filter_message_pattern_none stdout ---- thread 'git::tests::test_filter_message_pattern_none' (4811) panicked at src/git.rs:269:41: called `Result::unwrap()` on an `Err` value: Error { code: -3, klass: 6, message: "could not find repository at '.'" } ---- git::tests::test_filter_message_pattern_match stdout ---- thread 'git::tests::test_filter_message_pattern_match' (4809) panicked at src/git.rs:280:41: called `Result::unwrap()` on an `Err` value: Error { code: -3, klass: 6, message: "could not find repository at '.'" } failures: git::tests::test_filter_message_pattern_match git::tests::test_filter_message_pattern_no_match git::tests::test_filter_message_pattern_none test result: FAILED. 21 passed; 3 failed; 0 ignored; 0 measured; 3 filtered out; finished in 0.00s error: test failed, to rerun pass `--bin convco`