Running nixpkgs-update (https://nix-community.org/update-bot/) with UPDATE_INFO: convco 0.6.3 -> 0.7.1 https://github.com/convco/convco/releases attrpath: convco Checking auto update branch... No auto update branch exists [version] [version] generic version rewriter does not support multiple hashes [rustCrateVersion] [rustCrateVersion] Replacing cargoHash with sha256-TODCUav4Yd3Jvc57xEtFDCchJt0mb0FYDkP3CSj1omA= Received ExitFailure 1 when running Raw command: nix-build --option sandbox true --arg config "{ allowUnfree = true; allowAliases = false; }" --arg overlays "[ ]" -A convco nix build failed. test test_check_merge_commit ... FAILED test test_check_revert_commit ... FAILED failures: ---- test_check_success stdout ---- thread 'test_check_success' (5293) panicked at tests/common/mod.rs:62:10: called `Result::unwrap()` on an `Err` value: Os { code: 2, kind: NotFound, message: "No such file or directory" } ---- test_check_merge_commit stdout ---- thread 'test_check_merge_commit' (5291) panicked at tests/common/mod.rs:62:10: called `Result::unwrap()` on an `Err` value: Os { code: 2, kind: NotFound, message: "No such file or directory" } note: run with `RUST_BACKTRACE=1` environment variable to display a backtrace ---- test_check_revert_commit stdout ---- thread 'test_check_revert_commit' (5292) panicked at tests/common/mod.rs:62:10: called `Result::unwrap()` on an `Err` value: Os { code: 2, kind: NotFound, message: "No such file or directory" } failures: test_check_merge_commit test_check_revert_commit test_check_success test result: FAILED. 0 passed; 3 failed; 0 ignored; 0 measured; 0 filtered out; finished in 0.00s error: test failed, to rerun pass `--test check_test`