Running nixpkgs-update (https://nix-community.org/update-bot/) with UPDATE_INFO: cotp 1.9.7 -> 1.9.8 https://github.com/replydev/cotp/releases attrpath: cotp Checking auto update branch... No auto update branch exists [version] [version] generic version rewriter does not support multiple hashes [rustCrateVersion] [rustCrateVersion] Replacing cargoHash with sha256-IK6avkBE4xt7rM+8399WHaCTL5Y4hDSdyeTmq6ykfHI= Received ExitFailure 1 when running Raw command: nix-build --option sandbox true --arg config "{ allowUnfree = true; allowAliases = false; }" --arg overlays "[ ]" -A cotp nix build failed.  Running tests/cli_integration_tests.rs (target/x86_64-unknown-linux-gnu/release/deps/cli_integration_tests-4f52518755b2ed40) running 2 tests test cli_integration_test::test_help_subcommand ... ok test cli_integration_test::test_version_subcommand ... FAILED failures: ---- cli_integration_test::test_version_subcommand stdout ---- thread 'cli_integration_test::test_version_subcommand' (5913) panicked at /build/rustc-1.93.0-src/library/core/src/ops/function.rs:250:5: Unexpected stdout, failed var.is_match(^cotp \d+\.\d+\.\d+-DEBUG-.+) ├── var: cotp 1.9.8 └── var as str: cotp 1.9.8 command=`"/build/source/target/x86_64-unknown-linux-gnu/release/cotp" "--version"` code=0 stdout="cotp 1.9.8\n" stderr="" note: run with `RUST_BACKTRACE=1` environment variable to display a backtrace failures: cli_integration_test::test_version_subcommand test result: FAILED. 1 passed; 1 failed; 0 ignored; 0 measured; 0 filtered out; finished in 0.00s error: test failed, to rerun pass `--test cli_integration_tests`