Running nixpkgs-update (https://nix-community.org/update-bot/) with UPDATE_INFO: crow 1.3.0.0 -> 1.3.1 https://github.com/CrowCpp/Crow/releases attrpath: crow Checking auto update branch... No auto update branch exists [version] [version] updated version and sha256 [rustCrateVersion] [rustCrateVersion] No cargoHash found [golangModuleVersion] [golangModuleVersion] Not a buildGoModule package with vendorHash [npmDepsVersion] [npmDepsVersion] No npmDepsHash [updateScript] [updateScript] skipping because derivation has no updateScript Diff after rewrites: diff --git a/pkgs/by-name/cr/crow/package.nix b/pkgs/by-name/cr/crow/package.nix index 65ed605821db..9ca69b2626ed 100644 --- a/pkgs/by-name/cr/crow/package.nix +++ b/pkgs/by-name/cr/crow/package.nix @@ -10,13 +10,13 @@ stdenv.mkDerivation (finalAttrs: { pname = "crow"; - version = "1.3.0.0"; + version = "1.3.1"; src = fetchFromGitHub { owner = "CrowCpp"; repo = "Crow"; tag = "v${finalAttrs.version}"; - hash = "sha256-QLYQ0RouqDDvhnBF79O/9M7IwlF0eQ3HTqR6bXWm574="; + hash = "sha256-e7k3jgHnQt28mMLAW9P2rmfFntVr6ThpOCNlya4iLoU="; }; patches = [ Received ExitFailure 1 when running Raw command: nix-build --option sandbox true --arg config "{ allowUnfree = true; allowAliases = false; }" --arg overlays "[ ]" -A crow nix build failed. got build log for 'crow' from 'daemon' Running phase: unpackPhase @nix { "action": "setPhase", "phase": "unpackPhase" } unpacking source archive /nix/store/0agxwqwfs6393h7m49bspixhp88fwafm-source source root is source Running phase: patchPhase @nix { "action": "setPhase", "phase": "patchPhase" } applying patch /nix/store/rpv2ldn42yaqhyiffilq4aa10xwckjji-cpm.patch patching file CMakeLists.txt Hunk #1 FAILED at 11. 1 out of 1 hunk FAILED -- saving rejects to file CMakeLists.txt.rej patching file tests/CMakeLists.txt Hunk #1 FAILED at 5. 1 out of 1 hunk FAILED -- saving rejects to file tests/CMakeLists.txt.rej