Running nixpkgs-update (https://nix-community.org/update-bot/) with UPDATE_INFO: desync 1.0.3 -> 1.0.4 https://repology.org/project/desync/versions attrpath: desync Checking auto update branch... No auto update branch exists [version] [version] generic version rewriter does not support multiple hashes [rustCrateVersion] [rustCrateVersion] No cargoHash found [golangModuleVersion] [golangModuleVersion] Found old vendorHash = "sha256-unwaA+WNyaJbNrOFvjXeMI2YbNTpGBrjwBGXhvOfj0M=" [golangModuleVersion] Replaced vendorHash with sha256-PU2EbYei6X/fmA/POaFI6flAZYb2WcBA10E9+rS651U= Received ExitFailure 1 when running Raw command: nix-build --option sandbox true --arg config "{ allowUnfree = true; allowAliases = false; }" --arg overlays "[ ]" -A desync nix build failed. --- FAIL: TestUnTarNoSamePermissionsOverReadOnlyTree (0.00s) localfs_dirmeta_test.go:174: Error Trace: /build/source/localfs_dirmtime_test.go:19 /build/source/localfs_dirmeta_test.go:174 Error: Received unexpected error: xattr.list /build/TestUnTarNoSamePermissionsOverReadOnlyTree270882892/001: operation not supported Test: TestUnTarNoSamePermissionsOverReadOnlyTree --- FAIL: TestUnTarIntoReadOnlyDir (0.00s) localfs_dirmeta_test.go:193: Error Trace: /build/source/localfs_dirmtime_test.go:19 /build/source/localfs_dirmeta_test.go:193 Error: Received unexpected error: xattr.list /build/TestUnTarIntoReadOnlyDir1452186224/001: operation not supported Test: TestUnTarIntoReadOnlyDir --- FAIL: TestUnTarDirMTime (0.00s) localfs_dirmtime_test.go:40: Error Trace: /build/source/localfs_dirmtime_test.go:19 /build/source/localfs_dirmtime_test.go:40 Error: Received unexpected error: xattr.list /build/TestUnTarDirMTime937614661/001: operation not supported Test: TestUnTarDirMTime --- FAIL: TestTar (0.00s) tar_test.go:43: Error Trace: /build/source/tar_test.go:43 Error: Received unexpected error: xattr.list /build/TestTar1529503240/001: operation not supported Test: TestTar FAIL FAIL github.com/folbricht/desync 3.146s FAIL