Running nixpkgs-update (https://nix-community.org/update-bot/) with UPDATE_INFO: dufs 0.45.0 -> 0.46.0 https://github.com/sigoden/dufs/releases attrpath: dufs Checking auto update branch... No auto update branch exists [version] [version] generic version rewriter does not support multiple hashes [rustCrateVersion] [rustCrateVersion] Replacing cargoHash with sha256-H2ew+sb60UnXe3Dls9MSKwAk4hT/yLSbgZz6pVOkHQQ= Received ExitFailure 1 when running Raw command: nix-build --option sandbox true --arg config "{ allowUnfree = true; allowAliases = false; }" --arg overlays "[ ]" -A dufs nix build failed. thread 'default_not_allow_delete' (7567) panicked at /build/dufs-0.46.0-vendor/source-registry-0/reqwest-0.13.3/src/blocking/client.rs:1218:38: Client::new(): reqwest::Error { kind: Builder, source: General("No CA certificates were loaded from the system") } ---- allow_delete_no_override stdout ---- thread 'allow_delete_no_override' (7561) panicked at /build/dufs-0.46.0-vendor/source-registry-0/reqwest-0.13.3/src/blocking/client.rs:1218:38: Client::new(): reqwest::Error { kind: Builder, source: General("No CA certificates were loaded from the system") } ---- allow_upload_no_override stdout ---- thread 'allow_upload_no_override' (7564) panicked at /build/dufs-0.46.0-vendor/source-registry-0/reqwest-0.13.3/src/blocking/client.rs:1218:38: Client::new(): reqwest::Error { kind: Builder, source: General("No CA certificates were loaded from the system") } note: run with `RUST_BACKTRACE=1` environment variable to display a backtrace failures: allow_archive allow_delete_no_override allow_search allow_upload_delete_can_override allow_upload_no_override allow_upload_not_exist_dir default_not_allow_archive default_not_allow_delete default_not_allow_upload default_not_exist_dir test result: FAILED. 0 passed; 10 failed; 0 ignored; 0 measured; 0 filtered out; finished in 0.26s error: test failed, to rerun pass `--test allow`