Running nixpkgs-update (https://nix-community.org/update-bot/) with UPDATE_INFO: evtx 0.10.0 -> 0.11.2 https://github.com/omerbenamram/evtx/releases attrpath: evtx Checking auto update branch... No auto update branch exists [version] [version] generic version rewriter does not support multiple hashes [rustCrateVersion] [rustCrateVersion] Replacing cargoHash with sha256-RnuWlfmzOZzOMfeKo8tv9I4elLQgpn9IbVa0EpYGnI0= Received ExitFailure 1 when running Raw command: nix-build --option sandbox true --arg config "{ allowUnfree = true; allowAliases = false; }" --arg overlays "[ ]" -A evtx nix build failed. thread 'wevt_templates_research::wevt_dll_services' (7719) panicked at tests/test_wevt_templates.rs:1434:46: fixture should parse ---- wevt_templates_research::wevt_dll_lsasrv stdout ---- thread 'wevt_templates_research::wevt_dll_lsasrv' (7718) panicked at tests/test_wevt_templates.rs:1427:46: fixture should parse note: run with `RUST_BACKTRACE=1` environment variable to display a backtrace ---- wevt_templates_research::wevt_dll_adtschema stdout ---- thread 'wevt_templates_research::wevt_dll_adtschema' (7717) panicked at tests/test_wevt_templates.rs:1420:46: fixture should parse ---- wevt_templates_research::wevt_dll_wevtsvc stdout ---- thread 'wevt_templates_research::wevt_dll_wevtsvc' (7720) panicked at tests/test_wevt_templates.rs:1441:46: fixture should parse failures: wevt_templates_research::wevt_dll_adtschema wevt_templates_research::wevt_dll_lsasrv wevt_templates_research::wevt_dll_services wevt_templates_research::wevt_dll_wevtsvc test result: FAILED. 14 passed; 4 failed; 1 ignored; 0 measured; 0 filtered out; finished in 0.00s error: test failed, to rerun pass `--test test_wevt_templates`