Running nixpkgs-update (https://nix-community.org/update-bot/) with UPDATE_INFO: feedr 0.5.0 -> 0.7.0 https://github.com/bahdotsh/feedr/releases attrpath: feedr Checking auto update branch... No auto update branch exists [version] [version] generic version rewriter does not support multiple hashes [rustCrateVersion] [rustCrateVersion] Replacing cargoHash with sha256-3xSvqj2kW0lOFUzkAbBJThJx6u7f1tSk1qgFdm2tVfg= Received ExitFailure 1 when running Raw command: nix-build --option sandbox true --arg config "{ allowUnfree = true; allowAliases = false; }" --arg overlays "[ ]" -A feedr nix build failed. Warning: Could not create default config file: Failed to create config directory thread 'app::tests::test_mark_all_starred_read' (3707) panicked at src/app.rs:1936:39: called `Result::unwrap()` on an `Err` value: Permission denied (os error 13) ---- events::tests::test_category_management_navigation stdout ---- Warning: Could not create default config file: Failed to create config directory thread 'events::tests::test_category_management_navigation' (3721) panicked at src/events.rs:1810:9: assertion `left == right` failed left: CategoryManagement right: FeedList ---- events::tests::test_mark_all_read_dashboard stdout ---- Warning: Could not create default config file: Failed to create config directory thread 'events::tests::test_mark_all_read_dashboard' (3737) panicked at src/events.rs:1686:9: assertion failed: app.success_message.is_some() failures: app::tests::test_mark_all_dashboard_read app::tests::test_mark_all_feed_read app::tests::test_mark_all_starred_read events::tests::test_category_management_navigation events::tests::test_mark_all_read_dashboard test result: FAILED. 75 passed; 5 failed; 0 ignored; 0 measured; 0 filtered out; finished in 0.03s error: test failed, to rerun pass `--lib`